{"text_format":"1","workbook":"xlsx","n_sheets":11,"sheets":["Instructions","Presentation","God Makes The Rivers To Flow","Timeless Wisdom","Other Passages","My Name","My Notes","Version","Statistics","Lists","Backend"],"not_rendered":{"charts":0,"images":1,"macros":1,"external_links":0,"defined_names":126,"comments":1,"pivot_tables":0},"unopened":[],"bounds":{"document_bytes":16777216,"sheet_cells":100000,"rows_first":2000,"rows_last":500,"rows_between":2000,"halvings":0,"cell_chars":16384,"cell_head_chars":4096},"cells_cut":0,"cells_raw":0,"read":"whole","date_system":"1900"}

{"sheet":"Instructions","index":0,"n_rows":46,"n_cols":9,"rows_kept":46,"cut":false,"hidden":false,"merged":[[39,1,39,6],[45,1,45,6],[15,2,15,6],[23,2,23,6],[24,2,24,6],[25,4,25,6],[27,4,27,6],[4,1,4,6],[23,8,29,12],[33,4,33,6],[35,2,35,6],[36,2,36,6],[16,2,16,6]]}
[null,null,null,null,null,null,"Instructions for Using the Passage Portfolio"]
[]
[null,"For the portfolio to work, you must have Macros Enabled in your Excel options."]
[]
[null,"A video overview of how to use the passage portfolio is available here."]
[]
[null,"For any questions about the passage portfolio, feel free to email: PassagePortfolio@gmail.com"]
[]
[null,"Viewing Your Passages"]
[null,1,"Select the 'Presentation' worksheet from the tabs below."]
[null,2,"To sort your passages in different ways, use the dropdown list on row 4."]
[null,3,"To choose which columns to display, you have two options:"]
[null,null,null,"a.","To turn columns on or off, enter Yes or No using the controls on lines 7 to 12."]
[null,null,null,"b.","To chose which column are available, use the dropdowns on the right side of rows 10 to 12."]
[null,4,"To highlight passages that meet certain criteria, use the controls on rows 15 to 22."]
{"$rows_left_out":32}
{"sheet":"Presentation","index":1,"n_rows":318,"n_cols":13,"rows_kept":318,"cut":false,"hidden":false,"merged":[[25,10,25,11],[35,10,35,12],[17,10,17,11],[19,10,19,11],[21,10,21,12],[3,8,3,12],[9,10,9,12],[10,10,10,12],[11,10,11,12],[15,10,15,11]]}
[{"$f":"IF(ISTEXT('My Name'!B1),'My Name'!B1&\"'s Passage Portfolio\",\"Passage Portfolio\")","v":"Larry's Passage Portfolio"}]
["Author","Passage","Page","Years in Repertoire","Percent Memorized","Custom Categories"]
[null,null,null,"",null,null,null,"Sort Passages by:"]
["God Makes The Rivers To Flow ",null,null,"",null,null,null,null,"Book and page number"]
["","","","","",""]
["PART ONE","At the Source","","","","",null,"Columns to Display:"]
["","","","","","",null,null,"Yes",null,"Author"]
["Rabbi Abraham Isaac Kook","Radiant Is the World Soul",39,0.99383983572895274,1,"Joy",null,null,"Yes",null,"Passage"]
["","","","","","",null,null,"Yes",null,"Page"]
["PART TWO","Deep Currents","","","","",null,null,"Yes",null,"Years in Repertoire"]
["","","","","","",null,null,"Yes",null,"Percent Memorized"]
["Saint Francis of Assisi","The Prayer of Saint Francis",109,1.160848733744011,1,"Core",null,null,"Yes",null,"Custom Categories"]
["Lao Tzu","The Best",141,0.39698836413415467,1,""]
["Sri Sarada Devi","The Whole World Is Your Own",147,0.68993839835728954,0.5,"Reassurance, Joy",null,"Highlight Passages:"]
["","","","","","",null,null,"No","Years in repertoire of:"]
{"$rows_left_out":304}
{"sheet":"God Makes The Rivers To Flow","index":2,"n_rows":163,"n_cols":53,"rows_kept":163,"cut":false,"hidden":false,"merged":[[0,0,3,1],[3,3,3,6]]}
["God Makes The Rivers To Flow"]
[null,null,"Choose Passages to Diplay:"]
[null,null,null,null,null,null,null,null,null,"Show1",null,null,null,null,null,null,null,null,null,null,null,null,null,null,null,null,null,null,null,null,null,null,null,null,null,null,null,null,null,null,null,null,null,null,null,null,null,null,null,null,null,"Show1","Show2"]
[null,null,null,"All passages",null,null,null,null,null,{"$f":"\"*\"&D4&\"*\"","v":"*All passages*"},null,null,null,null,null,null,null,null,null,null,null,null,null,null,null,null,null,null,null,null,null,null,null,null,null,null,null,null,null,null,null,null,null,null,null,null,null,null,null,null,null,{"$f":"\"*\"&D4&\"*\"","v":"*All passages*"}]
[null,null,null,null,null,null,null,null,null,null,null,null,null,null,null,null,null,null,null,null,null,null,null,null,null,null,null,null,null,null,null,null,null,null,null,null,null,null,null,null,null,null,null,null,null,null,null,null,null,null,null,null,"Special"]
[]
["Author","Passage","Page","Date Begun\n(approximate)","Percent\nMemorized","Expertise\nLevel","Custom\nCategories","  ","Show1","Show2",null,null,null,null,null,null,null,null,null,null,null,null,null,null,null,null,null,null,null,null,null,null,null,null,null,null,null,null,null,null,null,null,null,null,null,null,null,null,null,null,null,"Show2"]
[null,null,null,null,null,null,null,null,null,"Special",null,null,null,null,null,null,null,null,null,null,null,null,null,null,null,null,null,null,null,null,null,null,null,null,null,null,null,null,null,null,null,null,null,null,null,null,null,null,null,null,null,"Special"]
["PART ONE","At the Source",null,null,null,null,null,null,null,"Special",null,null,null,null,null,null,null,null,null,null,null,null,null,null,null,null,null,null,null,null,null,null,null,null,null,null,null,null,null,null,null,null,null,null,null,null,null,null,null,null,null,"Special"]
[null,null,null,null,null,null,null,null,null,"Special",null,null,null,null,null,null,null,null,null,null,null,null,null,null,null,null,null,null,null,null,null,null,null,null,null,null,null,null,null,null,null,null,null,null,null,null,null,null,null,null,null,"Special"]
["The Upanishads","Invocations",29,null,null,null,null,null,"All passages"]
["Psalm 100","Worship the Lord in Gladness",30,null,null,null,null,null,"All passages, Changing Negativity: Dwelling on oneself, depression"]
["The Isha Upanishad","The Inner Ruler",31,null,null,null,null,null,"All passages, Positive Qualities: Courage, Changing Negativity: Greed, craving, selfish desire"]
["Lao Tzu","Holding to the Constant",34,null,null,null,null,null,"All passages, Positive Qualities: Compassion and generosity"]
["Lao Tzu","Mother of All Things",35,null,null,null,null,null,"All passages, Stage of Life: Families with small children, Positive Qualities: Courage"]
{"$rows_left_out":149}
{"sheet":"Timeless Wisdom","index":3,"n_rows":111,"n_cols":10,"rows_kept":111,"cut":false,"hidden":false,"merged":[[0,0,3,1],[3,3,3,7]]}
["Timeless Wisdom"]
[null,null,"Choose Passages to Diplay:"]
[null,null,"Show1","Show2"]
[null,null,null,"All passages"]
[null,null,"Passages not in God Makes the Rivers to Flow"]
[]
["Author","Passage","Page","Date Begun\n(approximate)","Percent\nMemorized","Expertise\nLevel","Custom\nCategories","  ","Show1","Show2"]
["St. Francis of Assisi","The Prayer of St. Francis",33,null,null,null,null,null,null,"All passages"]
["Isha Upanishad","The Inner Ruler",34,null,null,null,null,null,null,"All passages"]
["Lao Tzu","Holding to the Constant",37,null,null,null,null,null,null,"All passages"]
["Abraham Isaac Kook","Radiant Is the World Soul",38,null,null,null,null,null,null,"All passages"]
["Hasan Kaimi Baba","The Path of Love",39,null,null,null,null,null,null,"All passages"]
["St. Teresa of Avila","Let Nothing Upset You",40,null,null,null,null,null,null,"All passages"]
["The Buddha","Twin Verses",41,null,null,null,null,null,null,"All passages"]
["St. Symeon the New Theologian","I Know That He Reveals Himself",44,null,null,null,null,null,null,"All passages"]
{"$rows_left_out":97}
{"sheet":"Other Passages","index":4,"n_rows":58,"n_cols":7,"rows_kept":58,"cut":false,"hidden":false,"merged":[[0,0,3,1]]}
["Other Passages"]
[]
[]
[]
[]
[]
["Author","Passage",null,"Date Begun\n(approximate)","Percent\nMemorized","Expertise\nLevel","Custom\nCategories"]
["Eknath Easwaran","A Prayer for Meditation",null,"2016-08-01",1,"Skill"]
[null,"Paramahamsa Upanishad",null,null,null,"Planning to learn","Long"]
[]
[]
[]
[]
[]
[]
{"$rows_left_out":44}
{"sheet":"My Name","index":5,"n_rows":2,"n_cols":2,"rows_kept":2,"cut":false,"hidden":false,"merged":[[1,0,1,1]]}
["My name:","Larry"]
["Your name will be displayed at the top of the Presentation sheet."]

{"sheet":"My Notes","index":6,"n_rows":1,"n_cols":1,"rows_kept":1,"cut":false,"hidden":false,"merged":[]}
["Notes Page"]

{"sheet":"Version","index":7,"n_rows":1,"n_cols":2,"rows_kept":1,"cut":false,"hidden":true,"merged":[]}
["Portfolio version:","2016_10_29"]

{"sheet":"Statistics","index":8,"n_rows":10,"n_cols":2,"rows_kept":10,"cut":false,"hidden":true,"merged":[[0,0,0,1],[6,0,6,1]]}
["Passages in Repertoire: All\n(i.e., with any Date Begun, Percent Memorized, Expertise Level, or Other)"]
["God Makes The Rivers To Flow",{"$f":"COUNTIF(BackendFilterMirrorGMRF, \"\\\\SHOW\")","v":5}]
["Timeless Wisdom",{"$f":"COUNTIF(BackendFilterMirrorTW, \"\\\\SHOW\")","v":1}]
["Other Passages",{"$f":"COUNTIF(BackendFilterMirrorOP, \"\\\\SHOW\")","v":2}]
[]
[]
["Passages in Repertoire: Meeting Current Display Criteria"]
["God Makes The Rivers To Flow"]
["Timeless Wisdom"]
["Other Passages"]

{"sheet":"Lists","index":9,"n_rows":308,"n_cols":13,"rows_kept":308,"cut":false,"hidden":true,"merged":[]}
["Levels of Expertise","Levels of Expertise Order","Percent Memorized","Yes/No","Or More/Less","Sort Orders","Timeless Wisdom","God Makes The Rivers To Flow","Custom Categories: Mirror","Custom Categories: List","CustomCategoriesListCount","Columns To Display Choice"," "]
["Planning to learn",1,0,"Yes","or more","Book and page number","All passages","All passages",{"$f":"IF(ISBLANK(INDEX(GMTRTFCustomCategories,ROW()-1)),\"\",INDEX(GMTRTFCustomCategories,ROW()-1))","v":""},{"$f":"IFERROR(INDEX(FilterUniqueSort(ListsCustomCategoriesMirror),ROW()-1),NA())","v":"Core"},{"$f":"COUNTA(ListsCustomCategoriesList)-SUM(IF(ISNA(ListsCustomCategoriesList),1))","v":5},"Custom Categories"," "]
["Knowledge",2,0.25,"No","or less","Custom categories: A to Z","Passages not in God Makes the Rivers to Flow","Stage of Life: Expectant mothers & families with babies","",{"$f":"IFERROR(INDEX(FilterUniqueSort(ListsCustomCategoriesMirror),ROW()-1),NA())","v":"Joy"},null,"Expertise Level"," "]
["Production",3,0.5,null,null,"Custom categories: Z to A",null,"Stage of Life: Families with small children","",{"$f":"IFERROR(INDEX(FilterUniqueSort(ListsCustomCategoriesMirror),ROW()-1),NA())","v":"Long"},null,"Percent Memorized"," "]
["Skill",4,0.75,null,null,"Expertise level: lowest to highest",null,"Stage of Life: Teens","",{"$f":"IFERROR(INDEX(FilterUniqueSort(ListsCustomCategoriesMirror),ROW()-1),NA())","v":"Reassurance"},null,"Years in Repertoire"," "]
["Habit",5,1,null,null,"Expertise level: highest to lowest",null,"Stage of Life: Illness, pain, loss of function","",{"$f":"IFERROR(INDEX(FilterUniqueSort(ListsCustomCategoriesMirror),ROW()-1),NA())","v":"Reassurance, Joy"},null,null," "]
[null,null,null,null,null,"Percent memorized: lowest to highest",null,"Stage of Life: Caregivers","",{"$f":"IFERROR(INDEX(FilterUniqueSort(ListsCustomCategoriesMirror),ROW()-1),NA())","v":{"$error":"#N/A"}},null,null," "]
[null,null,null,null,null,"Percent memorized: highest to lowest",null,"Stage of Life: Death and Dying","",{"$f":"IFERROR(INDEX(FilterUniqueSort(ListsCustomCategoriesMirror),ROW()-1),NA())","v":{"$error":"#N/A"}},null,null," "]
[null,null,null,null,null,"Years in repertoire: newest to oldest",null,"Stage of Life: Grief and loss","",{"$f":"IFERROR(INDEX(FilterUniqueSort(ListsCustomCategoriesMirror),ROW()-1),NA())","v":{"$error":"#N/A"}},null,null," "]
[null,null,null,null,null,"Years in repertoire: oldest to newest",null,"Positive Qualities: Patience","Joy",{"$f":"IFERROR(INDEX(FilterUniqueSort(ListsCustomCategoriesMirror),ROW()-1),NA())","v":{"$error":"#N/A"}},null,null," "]
[null,null,null,null,null,null,null,"Positive Qualities: Compassion and generosity","",{"$f":"IFERROR(INDEX(FilterUniqueSort(ListsCustomCategoriesMirror),ROW()-1),NA())","v":{"$error":"#N/A"}},null,null," "]
[null,null,null,null,null,null,null,"Positive Qualities: Courage","",{"$f":"IFERROR(INDEX(FilterUniqueSort(ListsCustomCategoriesMirror),ROW()-1),NA())","v":{"$error":"#N/A"}},null,null," "]
[null,null,null,null,null,null,null,"Positive Qualities: Faith","",{"$f":"IFERROR(INDEX(FilterUniqueSort(ListsCustomCategoriesMirror),ROW()-1),NA())","v":{"$error":"#N/A"}},null,null," "]
[null,null,null,null,null,null,null,"Positive Qualities: Devotion to God","",{"$f":"IFERROR(INDEX(FilterUniqueSort(ListsCustomCategoriesMirror),ROW()-1),NA())","v":{"$error":"#N/A"}},null,null," "]
[null,null,null,null,null,null,null,"Positive Qualities: Putting others first","",{"$f":"IFERROR(INDEX(FilterUniqueSort(ListsCustomCategoriesMirror),ROW()-1),NA())","v":{"$error":"#N/A"}},null,null," "]
{"$rows_left_out":294}
{"sheet":"Backend","index":10,"n_rows":500,"n_cols":34,"rows_kept":500,"cut":false,"hidden":true,"merged":[[0,29,0,32],[0,11,0,21],[47,0,47,7],[33,9,37,9],[38,9,42,9],[23,9,27,9],[28,9,32,9],[3,9,7,9],[8,9,12,9],[13,9,17,9],[18,9,22,9],[0,0,0,9]]}
["Advanced Filter Logic Table",null,null,null,null,null,null,null,null,null,null,"Advanced Filter Result",null,null,null,null,null,null,null,null,null,null,null,null,null,null,null,null,null,"Advanced Filter Results VBA Cache",null,null,null," "]
[]
["Author","Passage","Page","Date Begun\n(approximate)","Percent Memorized","Expertise Level","Custom Categories","Special","Data Entered",null,null,"Author","Passage","Page","Years in Repertoire","Percent Memorized","Custom Categories","Custom Categories","Special","Data Entered","Expertise Order","Years in Repertoire","Years in Repertoire Order","Percent Memorized Order","Custom Categories Order","Years Highlight","Memorized Highlight","Expertise Highlight","Category Highlight","Date Begun (approx)","Percent Memorized","Expertise Level","Custom Categories"," "]
[null,null,null,{"$f":"IF(Presentation!$I$25=\"Yes\",IF(Presentation!$M$26=Lists!$E$2,\"<\",\">\")&DATE(YEAR(TODAY()), MONTH(TODAY()), DAY(TODAY())-Presentation!$K$26*365.242),\">-999999\")","v":">-999999"},{"$f":"IF(Presentation!$I$27=\"Yes\",IF(Presentation!$L$28=Lists!$E$2,\">=\",\"<=\")&Presentation!$K$28,\">-999999\")","v":">-999999"},{"$f":"IF(AND(Presentation!$I$29=\"Yes\",Presentation!$K30<>\"Yes\"),\"HIDE\",Presentation!$L30)","v":"Planning to learn"},{"$f":"IF(Presentation!$I$35=\"Yes\",\"*\" & _xlfn.IFNA(Presentation!$K$36, \"\") & \"*\",\"\")","v":""},null,"\\\\SHOW","Expertise:Yes, Date:Yes, Percent:Yes, CustomCat:Yes/No",null,null,null,null,"",null,null,null,"SPECIALGMRF",null,{"$f":"IFERROR(VLOOKUP($AF4,Lists!$A$2:$B$6,2,FALSE),IF(PresentationSortBy=ListsSortExpHigh,-9999999,9999999))","v":9999999},{"$f":"IFERROR(IF(ISBLANK($AD4),\"\",IF((TODAY()-$AD4)/365.25>=0.05,(TODAY()-$AD4)/365.25,\"< 0.1 yrs\")),\"\")","v":""},{"$f":"IF(OR(ISBLANK($V4),$V4=\"\"),IF(PresentationSortBy=ListsSortYearsOld,-999999,999999),TODAY()-$AD4)","v":999999},{"$f":"IF(OR(ISBLANK($AE4),$AE4=\"\"),IF(PresentationSortBy=ListsSortMemHigh,-999999,999999),$AE4)","v":999999},{"$f":"IF(OR(ISBLANK($AG4),$AG4=\"\"),IF(PresentationSortBy=ListsSortCustomCategoriesA,\"ZZZZZZZZZZZZZZZZZZZZZZZZZZZZZ\",\"!\"), $AG4)","v":"!"},{"$f":"AND(PresentationHighlightYearsMaster=\"Yes\", PresentationHighlightYearsNum<>\"\", IF(PresentationHighlightYearsMoreLess=\"or less\",OR($V4=\"< 0.1 yrs\",AND(ISNUMBER($V4),$V4<=(PresentationHighlightYearsNum+0.05))),AND(ISNUMBER($V4),$V4>=(PresentationHighlightYearsNum-0.05))))","v":false},{"$f":"AND(PresentationHighlightMemorizedMaster=\"Yes\", PresentationHighlightMemorizedNum<>\"\",IF(OR(ISBLANK($AE4),$AE4=\"\"),FALSE,IF(PresentationHighlightMemorizedMoreLess=\"or less\",$AE4<=PresentationHighlightMemorizedNum,$AE4>=PresentationHighlightMemorizedNum)))","v":false},{"$f":"IFERROR(AND(PresentationHighlightExpertiseMaster=\"Yes\",PresentationHighlightExpertiseVal<>\"\",IF(OR(ISBLANK($AF4),$AF4=\"\"),FALSE,IF(PresentationHighlightExpertiseMoreLess=\"or less\",VLOOKUP($AF4,ListsLevelsOfExpertise,2,FALSE)<=VLOOKUP(PresentationHighlightExpertiseVal,ListsLevelsOfExpertise,2,FALSE),VLOOKUP($AF4,ListsLevelsOfExpertise,2,FALSE)>=VLOOKUP(PresentationHighlightExpertiseVal,ListsLevelsOfExpertise,2,FALSE)))),FALSE)","v":false},{"$f":"AND(PresentationHighlightCategoriesMaster=\"Yes\",_xlfn.IFNA(PresentationHighlightCategoriesVal,\"\")<>\"\",IF(OR(ISBLANK($AG4),$AG4=\"\"),FALSE,NOT(ISERR(SEARCH(PresentationHighlightCategoriesVal,$AG4)))))","v":false},null,null,null,null," "]
[null,null,null,{"$f":"IF(Presentation!$I$25=\"Yes\",IF(Presentation!$M$26=Lists!$E$2,\"<\",\">\")&DATE(YEAR(TODAY()), MONTH(TODAY()), DAY(TODAY())-Presentation!$K$26*365.242),\">-999999\")","v":">-999999"},{"$f":"IF(Presentation!$I$27=\"Yes\",IF(Presentation!$L$28=Lists!$E$2,\">=\",\"<=\")&Presentation!$K$28,\">-999999\")","v":">-999999"},{"$f":"IF(AND(Presentation!$I$29=\"Yes\",Presentation!$K31<>\"Yes\"),\"HIDE\",Presentation!$L31)","v":"Knowledge"},{"$f":"IF(Presentation!$I$35=\"Yes\",\"*\" & _xlfn.IFNA(Presentation!$K$36, \"\") & \"*\",\"\")","v":""},null,"\\\\SHOW",null,null,"God Makes The Rivers To Flow ",null,null,"",null,null,null,"SPECIALGMRF",null,{"$f":"IFERROR(VLOOKUP($AF5,Lists!$A$2:$B$6,2,FALSE),IF(PresentationSortBy=ListsSortExpHigh,-9999999,9999999))","v":9999999},"",999999,999999,"!",false,false,false,false,null,null,null,null," "]
[null,null,null,{"$f":"IF(Presentation!$I$25=\"Yes\",IF(Presentation!$M$26=Lists!$E$2,\"<\",\">\")&DATE(YEAR(TODAY()), MONTH(TODAY()), DAY(TODAY())-Presentation!$K$26*365.242),\">-999999\")","v":">-999999"},{"$f":"IF(Presentation!$I$27=\"Yes\",IF(Presentation!$L$28=Lists!$E$2,\">=\",\"<=\")&Presentation!$K$28,\">-999999\")","v":">-999999"},{"$f":"IF(AND(Presentation!$I$29=\"Yes\",Presentation!$K32<>\"Yes\"),\"HIDE\",Presentation!$L32)","v":"Production"},{"$f":"IF(Presentation!$I$35=\"Yes\",\"*\" & _xlfn.IFNA(Presentation!$K$36, \"\") & \"*\",\"\")","v":""},null,"\\\\SHOW",null,null,"","","","","","","","SPECIALGMRF",null,{"$f":"IFERROR(VLOOKUP($AF6,Lists!$A$2:$B$6,2,FALSE),IF(PresentationSortBy=ListsSortExpHigh,-9999999,9999999))","v":9999999},"",999999,999999,"!",false,false,false,false,"","","",""," "]
[null,null,null,{"$f":"IF(Presentation!$I$25=\"Yes\",IF(Presentation!$M$26=Lists!$E$2,\"<\",\">\")&DATE(YEAR(TODAY()), MONTH(TODAY()), DAY(TODAY())-Presentation!$K$26*365.242),\">-999999\")","v":">-999999"},{"$f":"IF(Presentation!$I$27=\"Yes\",IF(Presentation!$L$28=Lists!$E$2,\">=\",\"<=\")&Presentation!$K$28,\">-999999\")","v":">-999999"},{"$f":"IF(AND(Presentation!$I$29=\"Yes\",Presentation!$K33<>\"Yes\"),\"HIDE\",Presentation!$L33)","v":"Skill"},{"$f":"IF(Presentation!$I$35=\"Yes\",\"*\" & _xlfn.IFNA(Presentation!$K$36, \"\") & \"*\",\"\")","v":""},null,"\\\\SHOW",null,null,"PART ONE","At the Source","","","","","","SPECIALGMRF",null,{"$f":"IFERROR(VLOOKUP($AF7,Lists!$A$2:$B$6,2,FALSE),IF(PresentationSortBy=ListsSortExpHigh,-9999999,9999999))","v":9999999},"",999999,999999,"!",false,false,false,false,"","","",""," "]
[null,null,null,{"$f":"IF(Presentation!$I$25=\"Yes\",IF(Presentation!$M$26=Lists!$E$2,\"<\",\">\")&DATE(YEAR(TODAY()), MONTH(TODAY()), DAY(TODAY())-Presentation!$K$26*365.242),\">-999999\")","v":">-999999"},{"$f":"IF(Presentation!$I$27=\"Yes\",IF(Presentation!$L$28=Lists!$E$2,\">=\",\"<=\")&Presentation!$K$28,\">-999999\")","v":">-999999"},{"$f":"IF(AND(Presentation!$I$29=\"Yes\",Presentation!$K34<>\"Yes\"),\"HIDE\",Presentation!$L34)","v":"Habit"},{"$f":"IF(Presentation!$I$35=\"Yes\",\"*\" & _xlfn.IFNA(Presentation!$K$36, \"\") & \"*\",\"\")","v":""},null,"\\\\SHOW",null,null,"","","","","","","","SPECIALGMRF",null,{"$f":"IFERROR(VLOOKUP($AF8,Lists!$A$2:$B$6,2,FALSE),IF(PresentationSortBy=ListsSortExpHigh,-9999999,9999999))","v":9999999},"",999999,999999,"!",false,false,false,false,"","","",""," "]
[null,null,null,{"$f":"IF(Presentation!$I$25=\"Yes\",IF(Presentation!$M$26=Lists!$E$2,\"<\",\">\")&DATE(YEAR(TODAY()), MONTH(TODAY()), DAY(TODAY())-Presentation!$K$26*365.242),\"\")","v":""},{"$f":"IF(Presentation!$I$27=\"Yes\",IF(Presentation!$L$28=Lists!$E$2,\">=\",\"<=\")&Presentation!$K$28,\">-999999\")","v":">-999999"},{"$f":"IF(AND(Presentation!$I$29=\"Yes\",Presentation!$K30<>\"Yes\"),\"HIDE\",Presentation!$L30)","v":"Planning to learn"},{"$f":"IF(Presentation!$I$35=\"Yes\",\"*\" & _xlfn.IFNA(Presentation!$K$36, \"\") & \"*\",\"\")","v":""},null,"\\\\SHOW","Expertise:Yes, Date:No, Percent:Yes, CustomCat:Yes/No",null,"Rabbi Abraham Isaac Kook","Radiant Is the World Soul",39,0.99383983572895274,1,"Joy","Joy",null,"\\\\SHOW",{"$f":"IFERROR(VLOOKUP($AF9,Lists!$A$2:$B$6,2,FALSE),IF(PresentationSortBy=ListsSortExpHigh,-9999999,9999999))","v":4},0.99383983572895274,363,1,"Joy",false,false,false,false,"2015-11-01",1,"Skill","Joy"," "]
[null,null,null,{"$f":"IF(Presentation!$I$25=\"Yes\",IF(Presentation!$M$26=Lists!$E$2,\"<\",\">\")&DATE(YEAR(TODAY()), MONTH(TODAY()), DAY(TODAY())-Presentation!$K$26*365.242),\"\")","v":""},{"$f":"IF(Presentation!$I$27=\"Yes\",IF(Presentation!$L$28=Lists!$E$2,\">=\",\"<=\")&Presentation!$K$28,\">-999999\")","v":">-999999"},{"$f":"IF(AND(Presentation!$I$29=\"Yes\",Presentation!$K31<>\"Yes\"),\"HIDE\",Presentation!$L31)","v":"Knowledge"},{"$f":"IF(Presentation!$I$35=\"Yes\",\"*\" & _xlfn.IFNA(Presentation!$K$36, \"\") & \"*\",\"\")","v":""},null,"\\\\SHOW",null,null,"","","","","","","","SPECIALGMRF",null,{"$f":"IFERROR(VLOOKUP($AF10,Lists!$A$2:$B$6,2,FALSE),IF(PresentationSortBy=ListsSortExpHigh,-9999999,9999999))","v":9999999},"",999999,999999,"!",false,false,false,false,"","","",""," "]
[null,null,null,{"$f":"IF(Presentation!$I$25=\"Yes\",IF(Presentation!$M$26=Lists!$E$2,\"<\",\">\")&DATE(YEAR(TODAY()), MONTH(TODAY()), DAY(TODAY())-Presentation!$K$26*365.242),\"\")","v":""},{"$f":"IF(Presentation!$I$27=\"Yes\",IF(Presentation!$L$28=Lists!$E$2,\">=\",\"<=\")&Presentation!$K$28,\">-999999\")","v":">-999999"},{"$f":"IF(AND(Presentation!$I$29=\"Yes\",Presentation!$K32<>\"Yes\"),\"HIDE\",Presentation!$L32)","v":"Production"},{"$f":"IF(Presentation!$I$35=\"Yes\",\"*\" & _xlfn.IFNA(Presentation!$K$36, \"\") & \"*\",\"\")","v":""},null,"\\\\SHOW",null,null,"PART TWO","Deep Currents","","","","","","SPECIALGMRF",null,{"$f":"IFERROR(VLOOKUP($AF11,Lists!$A$2:$B$6,2,FALSE),IF(PresentationSortBy=ListsSortExpHigh,-9999999,9999999))","v":9999999},"",999999,999999,"!",false,false,false,false,"","","",""," "]
[null,null,null,{"$f":"IF(Presentation!$I$25=\"Yes\",IF(Presentation!$M$26=Lists!$E$2,\"<\",\">\")&DATE(YEAR(TODAY()), MONTH(TODAY()), DAY(TODAY())-Presentation!$K$26*365.242),\"\")","v":""},{"$f":"IF(Presentation!$I$27=\"Yes\",IF(Presentation!$L$28=Lists!$E$2,\">=\",\"<=\")&Presentation!$K$28,\">-999999\")","v":">-999999"},{"$f":"IF(AND(Presentation!$I$29=\"Yes\",Presentation!$K33<>\"Yes\"),\"HIDE\",Presentation!$L33)","v":"Skill"},{"$f":"IF(Presentation!$I$35=\"Yes\",\"*\" & _xlfn.IFNA(Presentation!$K$36, \"\") & \"*\",\"\")","v":""},null,"\\\\SHOW",null,null,"","","","","","","","SPECIALGMRF",null,{"$f":"IFERROR(VLOOKUP($AF12,Lists!$A$2:$B$6,2,FALSE),IF(PresentationSortBy=ListsSortExpHigh,-9999999,9999999))","v":9999999},"",999999,999999,"!",false,false,false,false,"","","",""," "]
[null,null,null,{"$f":"IF(Presentation!$I$25=\"Yes\",IF(Presentation!$M$26=Lists!$E$2,\"<\",\">\")&DATE(YEAR(TODAY()), MONTH(TODAY()), DAY(TODAY())-Presentation!$K$26*365.242),\"\")","v":""},{"$f":"IF(Presentation!$I$27=\"Yes\",IF(Presentation!$L$28=Lists!$E$2,\">=\",\"<=\")&Presentation!$K$28,\">-999999\")","v":">-999999"},{"$f":"IF(AND(Presentation!$I$29=\"Yes\",Presentation!$K34<>\"Yes\"),\"HIDE\",Presentation!$L34)","v":"Habit"},{"$f":"IF(Presentation!$I$35=\"Yes\",\"*\" & _xlfn.IFNA(Presentation!$K$36, \"\") & \"*\",\"\")","v":""},null,"\\\\SHOW",null,null,"Saint Francis of Assisi","The Prayer of Saint Francis",109,1.160848733744011,1,"Core","Core",null,"\\\\SHOW",{"$f":"IFERROR(VLOOKUP($AF13,Lists!$A$2:$B$6,2,FALSE),IF(PresentationSortBy=ListsSortExpHigh,-9999999,9999999))","v":5},1.160848733744011,424,1,"Core",false,false,false,false,"2015-09-01",1,"Habit","Core"," "]
[null,null,null,{"$f":"IF(Presentation!$I$25=\"Yes\",IF(Presentation!$M$26=Lists!$E$2,\"<\",\">\")&DATE(YEAR(TODAY()), MONTH(TODAY()), DAY(TODAY())-Presentation!$K$26*365.242),\">-999999\")","v":">-999999"},{"$f":"IF(Presentation!$I$27=\"Yes\",IF(Presentation!$L$28=Lists!$E$2,\">=\",\"<=\")&Presentation!$K$28,\"\")","v":""},{"$f":"IF(AND(Presentation!$I$29=\"Yes\",Presentation!$K30<>\"Yes\"),\"HIDE\",Presentation!$L30)","v":"Planning to learn"},{"$f":"IF(Presentation!$I$35=\"Yes\",\"*\" & _xlfn.IFNA(Presentation!$K$36, \"\") & \"*\",\"\")","v":""},null,"\\\\SHOW","Expertise:Yes, Date:Yes, Percent:No, CustomCat:Yes/No",null,"Lao Tzu","The Best",141,0.39698836413415467,1,"","",null,"\\\\SHOW",{"$f":"IFERROR(VLOOKUP($AF14,Lists!$A$2:$B$6,2,FALSE),IF(PresentationSortBy=ListsSortExpHigh,-9999999,9999999))","v":4},0.39698836413415467,145,1,"!",false,false,false,false,"2016-06-06",1,"Skill",""," "]
[null,null,null,{"$f":"IF(Presentation!$I$25=\"Yes\",IF(Presentation!$M$26=Lists!$E$2,\"<\",\">\")&DATE(YEAR(TODAY()), MONTH(TODAY()), DAY(TODAY())-Presentation!$K$26*365.242),\">-999999\")","v":">-999999"},{"$f":"IF(Presentation!$I$27=\"Yes\",IF(Presentation!$L$28=Lists!$E$2,\">=\",\"<=\")&Presentation!$K$28,\"\")","v":""},{"$f":"IF(AND(Presentation!$I$29=\"Yes\",Presentation!$K31<>\"Yes\"),\"HIDE\",Presentation!$L31)","v":"Knowledge"},{"$f":"IF(Presentation!$I$35=\"Yes\",\"*\" & _xlfn.IFNA(Presentation!$K$36, \"\") & \"*\",\"\")","v":""},null,"\\\\SHOW",null,null,"Sri Sarada Devi","The Whole World Is Your Own",147,0.68993839835728954,0.5,"Reassurance, Joy","Reassurance, Joy",null,"\\\\SHOW",{"$f":"IFERROR(VLOOKUP($AF15,Lists!$A$2:$B$6,2,FALSE),IF(PresentationSortBy=ListsSortExpHigh,-9999999,9999999))","v":3},0.68993839835728954,252,0.5,"Reassurance, Joy",false,false,false,true,"2016-02-20",0.5,"Production","Reassurance, Joy"," "]
{"$rows_left_out":485}